Open CASCADE, the 3D modelling kernel
3D modeling & numerical simulation

Search the Forums
See All Topics
Open CASCADEShowroomGet it!Developer CornerSupport and ProductsAbout us
Technical overview
Areas of use
Advantages
FAQ
Screenshots
Shape factory
Shape gallery
Demonstrations
What's new
System requirements
Download Center
Public license
Documentation
Getting started
Forums
Open Source community
Training and e-learning
A-la Carte Support
Value-added software
Complementary Components
Customer Corner
Company Profile
Marketing Materials
Contact Us
News
Home / Developer Corner / Forums / Installation and building / installation

installation

installation
milind dhake 2012/03/26 13:31
I was trying to install on my UBUNTU 11.10 system 64 bits, i do ./congure which works fine but after i do make i get an error , I am new to this so please guide me through this the error i get is following,


make all-recursive
make[1]: Entering directory `/home/milind/software/OpenCASCADE652/ros'
Making all in adm/make
make[2]: Entering directory `/home/milind/software/OpenCASCADE652/ros/adm/make'
Making all in TKernel
make[3]: Entering directory `/home/milind/software/OpenCASCADE652/ros/adm/make/TKernel'
/bin/bash ../../../libtool --tag=CXX --mode=compile g++ -DHAVE_CONFIG_H -I. -I../../.. -I../../../inc -I../../../drv/FSD -I../../../src/FSD -I../../../drv/MMgt -I../../../src/MMgt -I../../../drv/OSD -I../../../src/OSD -I../../../drv/Plugin -I../../../src/Plugin -I../../../drv/Quantity -I../../../src/Quantity -I../../../drv/Resource -I../../../src/Resource -I../../../drv/SortTools -I../../../src/SortTools -I../../../drv/Standard -I../../../src/Standard -I../../../drv/StdFail -I../../../src/StdFail -I../../../drv/Storage -I../../../src/Storage -I../../../drv/TColStd -I../../../src/TColStd -I../../../drv/TCollection -I../../../src/TCollection -I../../../drv/TShort -I../../../src/TShort -I../../../drv/Units -I../../../src/Units -I../../../drv/UnitsAPI -I../../../src/UnitsAPI -I../../../drv/IncludeLibrary -I../../../src/IncludeLibrary -I../../../drv/Dico -I../../../src/Dico -I../../../drv/NCollection -I../../../src/NCollection -I../../../drv/Message -I../../../src/Message -D_OCC64 -m64 -DNDEBUG -DNo_Exception -ffriend-injection -fpermissive -DCSFDB -DOCC_CONVERT_SIGNALS -DLIN -DLININTEL -D_GNU_SOURCE=1 -O2 -MT Dico_DictionaryOfInteger_0.lo -MD -MP -MF .deps/Dico_DictionaryOfInteger_0.Tpo -c -o Dico_DictionaryOfInteger_0.lo `test -f '../../../drv/Dico/Dico_DictionaryOfInteger_0.cxx' || echo './'`../../../drv/Dico/Dico_DictionaryOfInteger_0.cxx
mv -f .deps/Dico_DictionaryOfInteger_0.Tpo .deps/Dico_DictionaryOfInteger_0.Plo
mv: cannot stat `.deps/Dico_DictionaryOfInteger_0.Tpo': No such file or directory
make[3]: *** [Dico_DictionaryOfInteger_0.lo] Error 1
make[3]: Leaving directory `/home/milind/software/OpenCASCADE652/ros/adm/make/TKernel'
make[2]: *** [all-recursive] Error 1
make[2]: Leaving directory `/home/milind/software/OpenCASCADE652/ros/adm/make'
make[1]: *** [all-recursive] Error 1
make[1]: Leaving directory `/home/milind/software/OpenCASCADE652/ros'
make: *** [all] Error 2
Game Milky 2012/04/16 08:50
      Hello milind;

I am working on the same system and stack at ./configure, could you please explain to me how you succeeded??
It would be much helpful if u explain me how you get installed finally!
Looking forward from you!
Game
 
 
Latest news
  • Open CASCADE Technology 6.7.0 is available for download!
  • Open CASCADE Technology 6.6.0 is available for download!
  • Open CASCADE Technology 6.5.5 is available for download!

  • © OPEN CASCADE 2000 - 2014  |  Search  |  Contacts   |  Site map